{"text_format":"1","workbook":"xlsx","n_sheets":8,"sheets":["Instructions","Paste Copy","Contractor CP","Subcontractor1","Subcontractor2","Subcontractor3","Roll Up","info Grid"],"not_rendered":{"charts":0,"images":0,"macros":1,"external_links":0,"defined_names":0,"comments":1,"pivot_tables":0},"unopened":[],"bounds":{"document_bytes":16777216,"sheet_cells":100000,"rows_first":2000,"rows_last":500,"rows_between":2000,"halvings":0,"cell_chars":16384,"cell_head_chars":4096},"cells_cut":0,"cells_raw":0,"read":"whole","date_system":"1900"}

{"sheet":"Instructions","index":0,"n_rows":33,"n_cols":2,"rows_kept":33,"cut":false,"hidden":false,"merged":[]}
["Instructions"]
[null,"All light blue fields are unlocked for vendor input"]
[1,"Go to Subcontractor1 tab and enter in the Payroll Tax, Insurance & Fringe Benefits on Labor (Refer to UGC). "]
[2,"Enter the markup percentage for that subcontractor (Refer to UGC). "]
[3,"Enter the mark-up percentage for the lower tier subcontractors (Refer to UGC)."]
[4,"Enter the Material, Equipment and Labor Costs by cost code detail for subcontractor1. "]
[5,"Enter the Material, Equipment and Labor Costs by cost code, for each of that subcontractor's lower tier subcontractors."]
[6,"Repeat the same process for additional subcontractors and their lower tiers. "]
{"$rows_left_out":26}
{"sheet":"Paste Copy","index":1,"n_rows":34,"n_cols":100,"rows_kept":34,"cut":false,"hidden":false,"merged":[]}
["Line #","Attachments","Item","Description","Currency","Ext. Cost","Commitment Line","Cost Code","Cost Type","Days","Phase","WBS","Period","Assigned To","Manufacturer","Mfr. #","CE ID","CCO ID","Notes","Type of Markup","Markup","Capital Work Complete",null,null,null,null,null,null,null,null,null,null,null,null,null,null,null,null,null,null,null,null,null,null,null,null,null,null,null,null,null,null,null,null,null,null,null,null,null,null,null,null,null,null,null,null,null,null,null,null,null,null,null,null,null,null,null,null,"Line #","Attachments","Item","Description","Currency","Ext. Cost","Commitment Line","Cost Code","Cost Type","Days","Phase","WBS","Period","Assigned To","Manufacturer","Mfr. #","CE ID","CCO ID","Notes","Type of Markup","Markup","Capital Work Complete"]
["","",null,"","","",null,"",null,"",null,null,null,null,null,null,null,null,null,null,"","",null,null,null,null,null,null,null,null,null,null,null,null,null,null,null,null,null,null,null,null,null,null,null,null,null,null,null,null,null,null,null,null,null,null,null,null,null,null,null,null,null,null,null,null,null,null,null,null,null,null,null,null,null,null,null,null,{"$f":"IF(CF2<>\"\",1,\"\")","v":""},{"$f":"IFERROR(INDEX('info Grid'!E$2:E$33,SMALL(IF('info Grid'!$A$2:$A$33<>0,ROW('info Grid'!A$2:A$33)-ROW('info Grid'!A$2)+1),ROWS('info Grid'!A$2:A2))),\"\")","v":""},null,{"$f":"IFERROR(INDEX('info Grid'!C$2:C$33,SMALL(IF('info Grid'!$A$2:$A$33<>0,ROW('info Grid'!A$2:A$33)-ROW('info Grid'!A$2)+1),ROWS('info Grid'!A$2:A2))),\"\")","v":""},{"$f":"IFERROR(INDEX('info Grid'!D$2:D$33,SMALL(IF('info Grid'!$A$2:$A$33<>0,ROW('info Grid'!A$2:A$33)-ROW('info Grid'!A$2)+1),ROWS('info Grid'!A$2:A2))),\"\")","v":""},{"$f":"IFERROR(INDEX('info Grid'!A$2:A$33,SMALL(IF('info Grid'!$A$2:$A$33<>0,ROW('info Grid'!A$2:A$33)-ROW('info Grid'!A$2)+1),ROWS('info Grid'!A$2:A2))),\"\")","v":""},null,{"$f":"IFERROR(INDEX('info Grid'!B$2:B$33,SMALL(IF('info Grid'!$A$2:$A$33<>0,ROW('info Grid'!A$2:A$33)-ROW('info Grid'!A$2)+1),ROWS('info Grid'!A$2:A2))),\"\")","v":""},null,{"$f":"IFERROR(INDEX('info Grid'!$I$2:$I$33,SMALL(IF('info Grid'!$A$2:$A$33<>0,ROW('info Grid'!A$2:A$33)-ROW('info Grid'!A$2)+1),ROWS('info Grid'!A$2:A2))),\"\")","v":""},null,null,null,null,null,null,null,null,null,null,{"$f":"IFERROR(INDEX('info Grid'!F$2:F$33,SMALL(IF('info Grid'!$A$2:$A$33<>0,ROW('info Grid'!A$2:A$33)-ROW('info Grid'!A$2)+1),ROWS('info Grid'!A$2:A2))),\"\")","v":""},{"$f":"IFERROR(INDEX('info Grid'!G$2:G$33,SMALL(IF('info Grid'!$A$2:$A$33<>0,ROW('info Grid'!A$2:A$33)-ROW('info Grid'!A$2)+1),ROWS('info Grid'!A$2:A2))),\"\")","v":""}]
["","",null,"","","",null,"",null,"",null,null,null,null,null,null,null,null,null,null,"","",null,null,null,null,null,null,null,null,null,null,null,null,null,null,null,null,null,null,null,null,null,null,null,null,null,null,null,null,null,null,null,null,null,null,null,null,null,null,null,null,null,null,null,null,null,null,null,null,null,null,null,null,null,null,null,null,{"$f":"IF(CF3<>\"\",2,\"\")","v":""},{"$f":"IFERROR(INDEX('info Grid'!E$2:E$33,SMALL(IF('info Grid'!$A$2:$A$33<>0,ROW('info Grid'!A$2:A$33)-ROW('info Grid'!A$2)+1),ROWS('info Grid'!A$2:A3))),\"\")","v":""},null,{"$f":"IFERROR(INDEX('info Grid'!C$2:C$33,SMALL(IF('info Grid'!$A$2:$A$33<>0,ROW('info Grid'!A$2:A$33)-ROW('info Grid'!A$2)+1),ROWS('info Grid'!A$2:A3))),\"\")","v":""},{"$f":"IFERROR(INDEX('info Grid'!D$2:D$33,SMALL(IF('info Grid'!$A$2:$A$33<>0,ROW('info Grid'!A$2:A$33)-ROW('info Grid'!A$2)+1),ROWS('info Grid'!A$2:A3))),\"\")","v":""},{"$f":"IFERROR(INDEX('info Grid'!A$2:A$33,SMALL(IF('info Grid'!$A$2:$A$33<>0,ROW('info Grid'!A$2:A$33)-ROW('info Grid'!A$2)+1),ROWS('info Grid'!A$2:A3))),\"\")","v":""},null,{"$f":"IFERROR(INDEX('info Grid'!B$2:B$33,SMALL(IF('info Grid'!$A$2:$A$33<>0,ROW('info Grid'!A$2:A$33)-ROW('info Grid'!A$2)+1),ROWS('info Grid'!B$2:B3))),\"\")","v":""},null,{"$f":"IFERROR(INDEX('info Grid'!$I$2:$I$33,SMALL(IF('info Grid'!$A$2:$A$33<>0,ROW('info Grid'!A$2:A$33)-ROW('info Grid'!A$2)+1),ROWS('info Grid'!A$2:A3))),\"\")","v":""},null,null,null,null,null,null,null,null,null,null,{"$f":"IFERROR(INDEX('info Grid'!F$2:F$33,SMALL(IF('info Grid'!$A$2:$A$33<>0,ROW('info Grid'!A$2:A$33)-ROW('info Grid'!A$2)+1),ROWS('info Grid'!A$2:A3))),\"\")","v":""},{"$f":"IFERROR(INDEX('info Grid'!G$2:G$33,SMALL(IF('info Grid'!$A$2:$A$33<>0,ROW('info Grid'!A$2:A$33)-ROW('info Grid'!A$2)+1),ROWS('info Grid'!A$2:A3))),\"\")","v":""}]
["","",null,"","","",null,"",null,"",null,null,null,null,null,null,null,null,null,null,"","",null,null,null,null,null,null,null,null,null,null,null,null,null,null,null,null,null,null,null,null,null,null,null,null,null,null,null,null,null,null,null,null,null,null,null,null,null,null,null,null,null,null,null,null,null,null,null,null,null,null,null,null,null,null,null,null,{"$f":"IF(CF4<>\"\",3,\"\")","v":""},{"$f":"IFERROR(INDEX('info Grid'!E$2:E$33,SMALL(IF('info Grid'!$A$2:$A$33<>0,ROW('info Grid'!A$2:A$33)-ROW('info Grid'!A$2)+1),ROWS('info Grid'!A$2:A4))),\"\")","v":""},null,{"$f":"IFERROR(INDEX('info Grid'!C$2:C$33,SMALL(IF('info Grid'!$A$2:$A$33<>0,ROW('info Grid'!A$2:A$33)-ROW('info Grid'!A$2)+1),ROWS('info Grid'!A$2:A4))),\"\")","v":""},{"$f":"IFERROR(INDEX('info Grid'!D$2:D$33,SMALL(IF('info Grid'!$A$2:$A$33<>0,ROW('info Grid'!A$2:A$33)-ROW('info Grid'!A$2)+1),ROWS('info Grid'!A$2:A4))),\"\")","v":""},{"$f":"IFERROR(INDEX('info Grid'!A$2:A$33,SMALL(IF('info Grid'!$A$2:$A$33<>0,ROW('info Grid'!A$2:A$33)-ROW('info Grid'!A$2)+1),ROWS('info Grid'!A$2:A4))),\"\")","v":""},null,{"$f":"IFERROR(INDEX('info Grid'!B$2:B$33,SMALL(IF('info Grid'!$A$2:$A$33<>0,ROW('info Grid'!A$2:A$33)-ROW('info Grid'!A$2)+1),ROWS('info Grid'!B$2:B4))),\"\")","v":""},null,{"$f":"IFERROR(INDEX('info Grid'!$I$2:$I$33,SMALL(IF('info Grid'!$A$2:$A$33<>0,ROW('info Grid'!A$2:A$33)-ROW('info Grid'!A$2)+1),ROWS('info Grid'!A$2:A4))),\"\")","v":""},null,null,null,null,null,null,null,null,null,null,{"$f":"IFERROR(INDEX('info Grid'!F$2:F$33,SMALL(IF('info Grid'!$A$2:$A$33<>0,ROW('info Grid'!A$2:A$33)-ROW('info Grid'!A$2)+1),ROWS('info Grid'!A$2:A4))),\"\")","v":""},{"$f":"IFERROR(INDEX('info Grid'!G$2:G$33,SMALL(IF('info Grid'!$A$2:$A$33<>0,ROW('info Grid'!A$2:A$33)-ROW('info Grid'!A$2)+1),ROWS('info Grid'!A$2:A4))),\"\")","v":""}]
["","",null,"","","",null,"",null,"",null,null,null,null,null,null,null,null,null,null,"","",null,null,null,null,null,null,null,null,null,null,null,null,null,null,null,null,null,null,null,null,null,null,null,null,null,null,null,null,null,null,null,null,null,null,null,null,null,null,null,null,null,null,null,null,null,null,null,null,null,null,null,null,null,null,null,null,{"$f":"IF(CF5<>\"\",4,\"\")","v":""},{"$f":"IFERROR(INDEX('info Grid'!E$2:E$33,SMALL(IF('info Grid'!$A$2:$A$33<>0,ROW('info Grid'!A$2:A$33)-ROW('info Grid'!A$2)+1),ROWS('info Grid'!A$2:A5))),\"\")","v":""},null,{"$f":"IFERROR(INDEX('info Grid'!C$2:C$33,SMALL(IF('info Grid'!$A$2:$A$33<>0,ROW('info Grid'!A$2:A$33)-ROW('info Grid'!A$2)+1),ROWS('info Grid'!A$2:A5))),\"\")","v":""},{"$f":"IFERROR(INDEX('info Grid'!D$2:D$33,SMALL(IF('info Grid'!$A$2:$A$33<>0,ROW('info Grid'!A$2:A$33)-ROW('info Grid'!A$2)+1),ROWS('info Grid'!A$2:A5))),\"\")","v":""},{"$f":"IFERROR(INDEX('info Grid'!A$2:A$33,SMALL(IF('info Grid'!$A$2:$A$33<>0,ROW('info Grid'!A$2:A$33)-ROW('info Grid'!A$2)+1),ROWS('info Grid'!A$2:A5))),\"\")","v":""},null,{"$f":"IFERROR(INDEX('info Grid'!B$2:B$33,SMALL(IF('info Grid'!$A$2:$A$33<>0,ROW('info Grid'!A$2:A$33)-ROW('info Grid'!A$2)+1),ROWS('info Grid'!B$2:B5))),\"\")","v":""},null,{"$f":"IFERROR(INDEX('info Grid'!$I$2:$I$33,SMALL(IF('info Grid'!$A$2:$A$33<>0,ROW('info Grid'!A$2:A$33)-ROW('info Grid'!A$2)+1),ROWS('info Grid'!A$2:A5))),\"\")","v":""},null,null,null,null,null,null,null,null,null,null,{"$f":"IFERROR(INDEX('info Grid'!F$2:F$33,SMALL(IF('info Grid'!$A$2:$A$33<>0,ROW('info Grid'!A$2:A$33)-ROW('info Grid'!A$2)+1),ROWS('info Grid'!A$2:A5))),\"\")","v":""},{"$f":"IFERROR(INDEX('info Grid'!G$2:G$33,SMALL(IF('info Grid'!$A$2:$A$33<>0,ROW('info Grid'!A$2:A$33)-ROW('info Grid'!A$2)+1),ROWS('info Grid'!A$2:A5))),\"\")","v":""}]
["","",null,"","","",null,"",null,"",null,null,null,null,null,null,null,null,null,null,"","",null,null,null,null,null,null,null,null,null,null,null,null,null,null,null,null,null,null,null,null,null,null,null,null,null,null,null,null,null,null,null,null,null,null,null,null,null,null,null,null,null,null,null,null,null,null,null,null,null,null,null,null,null,null,null,null,{"$f":"IF(CF6<>\"\",5,\"\")","v":""},{"$f":"IFERROR(INDEX('info Grid'!E$2:E$33,SMALL(IF('info Grid'!$A$2:$A$33<>0,ROW('info Grid'!A$2:A$33)-ROW('info Grid'!A$2)+1),ROWS('info Grid'!A$2:A6))),\"\")","v":""},null,{"$f":"IFERROR(INDEX('info Grid'!C$2:C$33,SMALL(IF('info Grid'!$A$2:$A$33<>0,ROW('info Grid'!A$2:A$33)-ROW('info Grid'!A$2)+1),ROWS('info Grid'!A$2:A6))),\"\")","v":""},{"$f":"IFERROR(INDEX('info Grid'!D$2:D$33,SMALL(IF('info Grid'!$A$2:$A$33<>0,ROW('info Grid'!A$2:A$33)-ROW('info Grid'!A$2)+1),ROWS('info Grid'!A$2:A6))),\"\")","v":""},{"$f":"IFERROR(INDEX('info Grid'!A$2:A$33,SMALL(IF('info Grid'!$A$2:$A$33<>0,ROW('info Grid'!A$2:A$33)-ROW('info Grid'!A$2)+1),ROWS('info Grid'!A$2:A6))),\"\")","v":""},null,{"$f":"IFERROR(INDEX('info Grid'!B$2:B$33,SMALL(IF('info Grid'!$A$2:$A$33<>0,ROW('info Grid'!A$2:A$33)-ROW('info Grid'!A$2)+1),ROWS('info Grid'!B$2:B6))),\"\")","v":""},null,{"$f":"IFERROR(INDEX('info Grid'!$I$2:$I$33,SMALL(IF('info Grid'!$A$2:$A$33<>0,ROW('info Grid'!A$2:A$33)-ROW('info Grid'!A$2)+1),ROWS('info Grid'!A$2:A6))),\"\")","v":""},null,null,null,null,null,null,null,null,null,null,{"$f":"IFERROR(INDEX('info Grid'!F$2:F$33,SMALL(IF('info Grid'!$A$2:$A$33<>0,ROW('info Grid'!A$2:A$33)-ROW('info Grid'!A$2)+1),ROWS('info Grid'!A$2:A6))),\"\")","v":""},{"$f":"IFERROR(INDEX('info Grid'!G$2:G$33,SMALL(IF('info Grid'!$A$2:$A$33<>0,ROW('info Grid'!A$2:A$33)-ROW('info Grid'!A$2)+1),ROWS('info Grid'!A$2:A6))),\"\")","v":""}]
["","",null,"","","",null,"",null,"",null,null,null,null,null,null,null,null,null,null,"","",null,null,null,null,null,null,null,null,null,null,null,null,null,null,null,null,null,null,null,null,null,null,null,null,null,null,null,null,null,null,null,null,null,null,null,null,null,null,null,null,null,null,null,null,null,null,null,null,null,null,null,null,null,null,null,null,{"$f":"IF(CF7<>\"\",6,\"\")","v":""},{"$f":"IFERROR(INDEX('info Grid'!E$2:E$33,SMALL(IF('info Grid'!$A$2:$A$33<>0,ROW('info Grid'!A$2:A$33)-ROW('info Grid'!A$2)+1),ROWS('info Grid'!A$2:A7))),\"\")","v":""},null,{"$f":"IFERROR(INDEX('info Grid'!C$2:C$33,SMALL(IF('info Grid'!$A$2:$A$33<>0,ROW('info Grid'!A$2:A$33)-ROW('info Grid'!A$2)+1),ROWS('info Grid'!A$2:A7))),\"\")","v":""},{"$f":"IFERROR(INDEX('info Grid'!D$2:D$33,SMALL(IF('info Grid'!$A$2:$A$33<>0,ROW('info Grid'!A$2:A$33)-ROW('info Grid'!A$2)+1),ROWS('info Grid'!A$2:A7))),\"\")","v":""},{"$f":"IFERROR(INDEX('info Grid'!A$2:A$33,SMALL(IF('info Grid'!$A$2:$A$33<>0,ROW('info Grid'!A$2:A$33)-ROW('info Grid'!A$2)+1),ROWS('info Grid'!A$2:A7))),\"\")","v":""},null,{"$f":"IFERROR(INDEX('info Grid'!B$2:B$33,SMALL(IF('info Grid'!$A$2:$A$33<>0,ROW('info Grid'!A$2:A$33)-ROW('info Grid'!A$2)+1),ROWS('info Grid'!B$2:B7))),\"\")","v":""},null,{"$f":"IFERROR(INDEX('info Grid'!$I$2:$I$33,SMALL(IF('info Grid'!$A$2:$A$33<>0,ROW('info Grid'!A$2:A$33)-ROW('info Grid'!A$2)+1),ROWS('info Grid'!A$2:A7))),\"\")","v":""},null,null,null,null,null,null,null,null,null,null,{"$f":"IFERROR(INDEX('info Grid'!F$2:F$33,SMALL(IF('info Grid'!$A$2:$A$33<>0,ROW('info Grid'!A$2:A$33)-ROW('info Grid'!A$2)+1),ROWS('info Grid'!A$2:A7))),\"\")","v":""},{"$f":"IFERROR(INDEX('info Grid'!G$2:G$33,SMALL(IF('info Grid'!$A$2:$A$33<>0,ROW('info Grid'!A$2:A$33)-ROW('info Grid'!A$2)+1),ROWS('info Grid'!A$2:A7))),\"\")","v":""}]
["","",null,"","","",null,"",null,"",null,null,null,null,null,null,null,null,null,null,"","",null,null,null,null,null,null,null,null,null,null,null,null,null,null,null,null,null,null,null,null,null,null,null,null,null,null,null,null,null,null,null,null,null,null,null,null,null,null,null,null,null,null,null,null,null,null,null,null,null,null,null,null,null,null,null,null,{"$f":"IF(CF8<>\"\",7,\"\")","v":""},{"$f":"IFERROR(INDEX('info Grid'!E$2:E$33,SMALL(IF('info Grid'!$A$2:$A$33<>0,ROW('info Grid'!A$2:A$33)-ROW('info Grid'!A$2)+1),ROWS('info Grid'!A$2:A8))),\"\")","v":""},null,{"$f":"IFERROR(INDEX('info Grid'!C$2:C$33,SMALL(IF('info Grid'!$A$2:$A$33<>0,ROW('info Grid'!A$2:A$33)-ROW('info Grid'!A$2)+1),ROWS('info Grid'!A$2:A8))),\"\")","v":""},{"$f":"IFERROR(INDEX('info Grid'!D$2:D$33,SMALL(IF('info Grid'!$A$2:$A$33<>0,ROW('info Grid'!A$2:A$33)-ROW('info Grid'!A$2)+1),ROWS('info Grid'!A$2:A8))),\"\")","v":""},{"$f":"IFERROR(INDEX('info Grid'!A$2:A$33,SMALL(IF('info Grid'!$A$2:$A$33<>0,ROW('info Grid'!A$2:A$33)-ROW('info Grid'!A$2)+1),ROWS('info Grid'!A$2:A8))),\"\")","v":""},null,{"$f":"IFERROR(INDEX('info Grid'!B$2:B$33,SMALL(IF('info Grid'!$A$2:$A$33<>0,ROW('info Grid'!A$2:A$33)-ROW('info Grid'!A$2)+1),ROWS('info Grid'!B$2:B8))),\"\")","v":""},null,{"$f":"IFERROR(INDEX('info Grid'!$I$2:$I$33,SMALL(IF('info Grid'!$A$2:$A$33<>0,ROW('info Grid'!A$2:A$33)-ROW('info Grid'!A$2)+1),ROWS('info Grid'!A$2:A8))),\"\")","v":""},null,null,null,null,null,null,null,null,null,null,{"$f":"IFERROR(INDEX('info Grid'!F$2:F$33,SMALL(IF('info Grid'!$A$2:$A$33<>0,ROW('info Grid'!A$2:A$33)-ROW('info Grid'!A$2)+1),ROWS('info Grid'!A$2:A8))),\"\")","v":""},{"$f":"IFERROR(INDEX('info Grid'!G$2:G$33,SMALL(IF('info Grid'!$A$2:$A$33<>0,ROW('info Grid'!A$2:A$33)-ROW('info Grid'!A$2)+1),ROWS('info Grid'!A$2:A8))),\"\")","v":""}]
{"$rows_left_out":27}
{"sheet":"Contractor CP","index":2,"n_rows":50,"n_cols":10,"rows_kept":50,"cut":false,"hidden":false,"merged":[[18,2,20,2],[18,9,20,9],[18,3,18,7],[18,8,20,8]]}
["Prime Contractor"]
["Change Proposal No."]
["(Prime Contractor to include, as backup, a completed form showing cost of work breakdown by Schedule of Values line items)"]
[]
[null,null,"Subtotal Cost for Self Performed Work",null,null,null,null,{"$f":"H50","v":0}]
["03-96-014119","Contractor Fee/Mark Up","Mark Up/Fee (See contract or UGC) ",null,null,null,null,{"$f":"H5*G6","v":0}]
[null,null,"Subtotal for Self Performed Work",null,null,null,null,{"$f":"SUM(H5:H6)","v":0}]
[null,null,"Subtotal Cost for Subcontracted Work",null,null,null,null,{"$f":"I50","v":0}]
{"$rows_left_out":43}
{"sheet":"Subcontractor1","index":3,"n_rows":48,"n_cols":42,"rows_kept":48,"cut":false,"hidden":false,"merged":[[9,2,9,8],[6,28,6,34],[7,28,7,34],[6,35,6,41],[7,35,7,41],[9,9,9,11],[6,14,6,20],[7,14,7,20],[6,21,6,27],[7,21,7,27]]}
["Subcontractor Name"]
["Change Proposal No."]
[]
[null,null,null,"Payroll Tax, Insurance & Fringe Benefits on Labor"]
[null,null,null,"Mark-Up for self performed work"]
[null,null,null,"Mark-Up for lower tier subcontractor  "]
[null,null,null,null,null,null,null,null,null,null,null,null,null,null,"Lower Tier Subcontractor Performed Work",null,null,null,null,null,null,"Lower Tier Subcontractor Performed Work",null,null,null,null,null,null,"Lower Tier Subcontractor Performed Work",null,null,null,null,null,null,"Lower Tier Subcontractor Performed Work"]
[null,null,null,null,null,null,null,null,null,null,null,null,null,null,"Insert Subcontractor Name",null,null,null,null,null,null,"Insert Subcontractor Name",null,null,null,null,null,null,"Insert Subcontractor Name",null,null,null,null,null,null,"Insert Subcontractor Name"]
{"$rows_left_out":41}
{"sheet":"Subcontractor2","index":4,"n_rows":48,"n_cols":42,"rows_kept":48,"cut":false,"hidden":false,"merged":[[6,35,6,41],[7,14,7,20],[7,21,7,27],[7,28,7,34],[7,35,7,41],[9,2,9,8],[9,9,9,11],[6,14,6,20],[6,21,6,27],[6,28,6,34]]}
["Subcontractor Name"]
["Change Proposal No."]
[]
[null,null,null,"Payroll Tax, Insurance & Fringe Benefits on Labor"]
[null,null,null,"Mark-Up for self performed work"]
[null,null,null,"Mark-Up for lower tier subcontractor  "]
[null,null,null,null,null,null,null,null,null,null,null,null,null,null,"Lower Tier Subcontractor Performed Work",null,null,null,null,null,null,"Lower Tier Subcontractor Performed Work",null,null,null,null,null,null,"Lower Tier Subcontractor Performed Work",null,null,null,null,null,null,"Lower Tier Subcontractor Performed Work"]
[null,null,null,null,null,null,null,null,null,null,null,null,null,null,"Insert Subcontractor Name",null,null,null,null,null,null,"Insert Subcontractor Name",null,null,null,null,null,null,"Insert Subcontractor Name",null,null,null,null,null,null,"Insert Subcontractor Name"]
{"$rows_left_out":41}
{"sheet":"Subcontractor3","index":5,"n_rows":48,"n_cols":42,"rows_kept":48,"cut":false,"hidden":false,"merged":[[9,2,9,8],[9,9,9,11],[6,14,6,20],[6,21,6,27],[6,28,6,34],[6,35,6,41],[7,14,7,20],[7,21,7,27],[7,28,7,34],[7,35,7,41]]}
["Subcontractor Name"]
["Change Proposal No."]
[]
[null,null,null,"Payroll Tax, Insurance & Fringe Benefits on Labor"]
[null,null,null,"Mark-Up for self performed work"]
[null,null,null,"Mark-Up for lower tier subcontractor  "]
[null,null,null,null,null,null,null,null,null,null,null,null,null,null,"Lower Tier Subcontractor Performed Work",null,null,null,null,null,null,"Lower Tier Subcontractor Performed Work",null,null,null,null,null,null,"Lower Tier Subcontractor Performed Work",null,null,null,null,null,null,"Lower Tier Subcontractor Performed Work"]
[null,null,null,null,null,null,null,null,null,null,null,null,null,null,"Insert Subcontractor Name",null,null,null,null,null,null,"Insert Subcontractor Name",null,null,null,null,null,null,"Insert Subcontractor Name",null,null,null,null,null,null,"Insert Subcontractor Name"]
{"$rows_left_out":41}
{"sheet":"Roll Up","index":6,"n_rows":41,"n_cols":3,"rows_kept":41,"cut":false,"hidden":true,"merged":[]}
["This Worksheet provides a summary of the CP costs by Cost Code in a format that can be uploaded or cut and pasted into PMWeb."]
[]
["Contractor Name",{"$f":"'Contractor CP'!B1","v":0}]
["OCO Number"]
["Total Value of Proposals",{"$f":"C41","v":0}]
["Total days claimed"]
[]
[null,null,"TOTAL Value"]
{"$rows_left_out":34}
{"sheet":"info Grid","index":7,"n_rows":33,"n_cols":9,"rows_kept":33,"cut":false,"hidden":true,"merged":[]}
["Amount","Cost Code","Description"]
[{"$f":"'Contractor CP'!H15","v":0},"03-95-010000","General Conditions (less Insurance & Bonds)","USD - Dollars (USA)",0,0,false,0,{"$f":"'Contractor CP'!J15","v":0}]
[{"$f":"'Contractor CP'!H14","v":0},"03-95-014110","Insurance & Bonds","USD - Dollars (USA)",0,0,false,0]
[{"$f":"'Contractor CP'!H6+'Contractor CP'!H9","v":0},"03-96-014119","Contractor Fee & Mark-up","USD - Dollars (USA)",0,0,false,0]
[{"$f":"'Contractor CP'!C22","v":0},"03-01-000000","General Requirements","USD - Dollars (USA)",0,0,false,0]
[{"$f":"'Contractor CP'!C23","v":0},"03-02-020000","Existing Conditions","USD - Dollars (USA)",0,0,false,0]
[{"$f":"'Contractor CP'!C24","v":0},"03-03-030000","Concrete","USD - Dollars (USA)",0,0,false,0]
[{"$f":"'Contractor CP'!C25","v":0},"03-04-040000","Masonry","USD - Dollars (USA)",0,0,false,0]
{"$rows_left_out":25}